{"text_format":"1","workbook":"xlsx","n_sheets":17,"sheets":["2015 Reserve Cost Estimates","2015 Budget & Fee Analysis","2015 Budget","Notes - keep!","Instructions","Tables & References","RESERVE Cost Estimates","GENERAL FUND Estimates","Calculations","Costs by Unit 1270","Costs by Unit 1272","Costs by Unit 1274","Costs by Unit 1276","Costs by Unit 1278","Calculated Budget Report","Published Budget Report","Sheet1"],"not_rendered":{"charts":0,"images":9,"macros":0,"external_links":0,"defined_names":18,"comments":4,"pivot_tables":0},"unopened":[],"bounds":{"document_bytes":16777216,"sheet_cells":100000,"rows_first":2000,"rows_last":500,"rows_between":2000,"halvings":0,"cell_chars":16384,"cell_head_chars":4096},"cells_cut":0,"cells_raw":0,"read":"whole","date_system":"1900"}

{"sheet":"2015 Reserve Cost Estimates","index":0,"n_rows":105,"n_cols":12,"rows_kept":105,"cut":false,"hidden":true,"merged":[]}
["Roofing",null,null,null,null,null,null,null,"2015 Est. Inflation Factor","2015 Material / Labor Cost Increases","Total 2015 Est. Cost Increase","Total 2015 Est. Cost"]
["every 20 or \n30 years","2009 Budget with Quotes","Total 2014 Est. Cost",null,null,null,null,null,0,0.02,{"$f":"SUM(I2:J2)","v":0.02}]
["8-Plex",{"$f":"47400","v":47400},58650.390711,null,null,null,null,null,null,null,null,{"$f":"(C3*(1+$K$2))","v":59823.39852522}]
[1272,{"$f":"23300","v":23300},28830.255349499999,null,null,null,null,null,null,null,null,{"$f":"(C4*(1+$K$2))","v":29406.860456490002}]
[1274,{"$f":"25675","v":25675},31768.961635125001,null,null,null,null,null,null,null,null,{"$f":"(C5*(1+$K$2))","v":32404.340867827501}]
[1276,{"$f":"(6.58*1825)*2","v":24017},29717.435310254998,null,null,null,null,null,null,null,null,{"$f":"(C6*(1+$K$2))","v":30311.784016460097}]
[]
[]
{"$rows_left_out":98}
{"sheet":"2015 Budget & Fee Analysis","index":1,"n_rows":96,"n_cols":19,"rows_kept":96,"cut":false,"hidden":true,"merged":[[5,18,8,18],[77,18,80,18],[66,18,69,18],[5,15,8,15],[5,7,8,7],[5,8,8,8],[5,9,8,9],[5,10,8,10]]}
["Hilary Heights Condominium Owners' Association",null,null,null,null,null,null,null,null,"Revised 11/2014"]
["2015 Budget and Fee Analysis"]
["Prepared by: Deb Ryan, Mary Sands, Carol Jacobs, Jared Clemetsen, Charlie Mohr"]
["E X P E N S E S",null,null,null,null,null,null,"F E E    A N A L Y S I S"]
[]
[null,null,null,null,null,null,null,"1270 Monthly Total Per Unit","1272 Monthly Total Per Unit","1274 Monthly Total Per Unit","1276 Monthly Total Per Unit",null,null,null,null,"Reserve Fund Totals Per Type of Unit Thru",null,null,"Reserve Fund Totals for All Units Per Month Thru"]
["Roofing",30]
["Recurrence in Years",20]
{"$rows_left_out":89}
{"sheet":"2015 Budget","index":2,"n_rows":54,"n_cols":7,"rows_kept":54,"cut":false,"hidden":true,"merged":[[0,1,1,3]]}
[null,"Hilary Heights Condominium Owners' Association \n2015 Operating Budget                                                                        "]
[]
[null,"Category / Account","Annual Budget Average per Month","Yearly Total"]
[null,"Business Income",null,""]
[null,"Business Income - Other",0,0]
[null,"Account Adjustment Credit",0,0]
[null,"Association Dues"]
[null,"1270 - 8 units total",{"$f":"(('2015 Budget & Fee Analysis'!H76)*8)","v":1080},{"$f":"C8*12","v":12960}]
{"$rows_left_out":47}
{"sheet":"Notes - keep!","index":3,"n_rows":27,"n_cols":13,"rows_kept":27,"cut":false,"hidden":true,"merged":[]}
[null,"2013 Notes:"]
[]
[1,"Should road repair be based off of 2012 estimate or off of actual?"]
[2,"1276 dues are $20 less per month due to their roof set at 30 years - is this accurate with tree overhang?"]
[]
[]
[null,"2014 Notes:"]
[1,"The 2014 budget formulas were adjusted to bring in the correct painting reserve accrual.   "]
{"$rows_left_out":20}
{"sheet":"Instructions","index":4,"n_rows":29,"n_cols":3,"rows_kept":29,"cut":false,"hidden":true,"merged":[[20,1,20,10],[24,1,24,10],[26,1,26,10],[28,1,28,10],[5,1,5,10],[17,2,17,10],[19,1,19,10]]}
[null,"Hilary Heights Condominium Owners' Association"]
[null,"Annual Operating Budget"]
[]
[null,"Notes and Instructions for completing"]
[]
[null,"This Excel Workbook was a complete re-design of the workbook used for the 2015 year budget.  It was however generated from the 2015 budget year workbook.  Those worksheets for the 2015 budget are preserved in this new workbook; they are hidden at the front end of this new workbook and can be referenced or viewed by using the unhide command.  All the worksheets in this new budget workbook are PROTECTED without a password.  Only the YELLOW UNLOCKED data INPUT cells can be selected.  The author of this workbook is Richard Rooker (920-207-4471)."]
[]
[null,"Cell Color Legend:"]
{"$rows_left_out":22}
{"sheet":"Tables & References","index":5,"n_rows":40,"n_cols":10,"rows_kept":40,"cut":false,"hidden":false,"merged":[[38,1,38,2],[1,6,1,7],[2,1,2,2],[7,1,7,3],[17,1,17,2],[30,1,30,2]]}
[]
[null,null,null,null,null,null,"General Fund Expenses",null,null,"Reserve Funds"]
[null,"BUDGET YEAR",null,null,null,null,"Category","Type",null,"Roofing Accrual"]
[null,"Current (New) Budget Year",2019,null,null,null,"Dues and Subscriptions","Business",null,"Road Maintenance Accrual"]
[null,"Previous Budget Year",{"$f":"IF(C4=\"\",\"\",C4-1)","v":2018},null,null,null,null,null,null,"Painting/Power Washing Accrual"]
[null,null,null,null,null,null,"Supplies, Business","Business",null,"General Building Maintenance Accrual"]
[null,null,null,null,null,null,"Bank Charge","Business",null,"Insurance Accrual"]
[null,"UNIT INFORMATION",null,null,null,null,"Business, Other","Business",null,"Legal-Profession Fees Accrual"]
{"$rows_left_out":33}
{"sheet":"RESERVE Cost Estimates","index":6,"n_rows":43,"n_cols":9,"rows_kept":43,"cut":false,"hidden":false,"merged":[[3,4,3,5],[3,6,5,6],[3,7,5,7],[2,3,2,7]]}
[]
[]
[null,null,null,"HHCOA Estimated Reserve Costs"]
[null,null,null,"Previous Budget Year","Current Budget Year",null,"Precedent Value: An actual Quote value will override any Estimate value.  It is this value that will be used in the calculations","Cost Per Year"]
[null,null,null,{"$f":"previous_budget_year","v":2018},{"$f":"current_budget_year","v":2019},{"$f":"current_budget_year","v":2019}]
[null,null,null,"Estimate","Calculated Estimate","From Quote or New Estimate"]
[null,{"$f":"'Tables & References'!J3","v":"Roofing Accrual"}]
[null,1270,null,54907.678,{"$f":"IF(D8=\"\",\"\",D8+(D8*(inflation_rate+construction_cost_increase)))","v":58696.307782000003},{"$f":"AVERAGE(D8:E8)","v":56801.992891000002},{"$f":"IF(AND(E8=\"\",F8=\"\"),\"\",IF(F8=\"\",E8,F8))","v":56801.992891000002},{"$f":"G8/roofing_recurrence_A","v":2840.09964455},"Latest Quote is from 2016"]
{"$rows_left_out":36}
{"sheet":"GENERAL FUND Estimates","index":7,"n_rows":25,"n_cols":16,"rows_kept":25,"cut":false,"hidden":false,"merged":[[1,4,1,5],[0,1,0,5],[1,1,3,1],[1,2,3,2]]}
[null,"HHCOA Estimated General Fund Costs"]
[null,"Expense Category","Expense Type","Previous Budget Year","Current Budget Year",null,null,null,null,"Parms Combo Plan",null,"Original Budget"]
[null,null,null,{"$f":"previous_budget_year","v":2018},{"$f":"previous_budget_year","v":2018},{"$f":"current_budget_year","v":2019},"Notes",null,"Lawn Care",{"$f":"945*7+(955)","v":7570},null,7367]
[null,null,null,"Budget","Actual:  Last 12 months by category per Quicken Reports.","Budget","2017-2018 Actual taken from the PAST 12 MONTHS Spending By Category report in QUICKEN as of 7/10/2018",null,"Snow",{"$f":"945*5","v":4725},null,4250]
[null,"Administration Fee","Business",12,10,10,null,null,null,{"$f":"SUM(J3:J4)","v":12295},null,{"$f":"SUM(L3:L4)","v":11617}]
[null,"Dues and Subscriptions","Business",130,167,170,"Includes Annual Quicken Renewal for Mary",null,null,null,"Difference:",{"$f":"J5-L5","v":678}]
[null,null,null,null,null,null,null,null,"Remove plastic edging"]
[null,"Supplies, Business","Business",150,284,300,null,null,1500,1270,null,{"$f":"678/12/16","v":3.53125}]
{"$rows_left_out":18}
{"sheet":"Calculations","index":8,"n_rows":44,"n_cols":46,"rows_kept":44,"cut":false,"hidden":false,"merged":[[43,23,43,25],[3,1,3,6],[16,19,16,21],[33,19,33,20],[3,16,3,17],[3,7,3,8],[17,19,17,20],[18,19,18,20],[19,19,19,20],[20,19,20,20],[32,19,32,21],[21,19,21,20],[28,16,30,16],[3,11,3,15],[3,19,3,21],[34,19,34,20],[35,19,35,20],[36,19,36,20],[13,26,14,27],[25,25,27,25],[16,23,16,25],[17,23,17,24],[18,23,18,24],[19,23,19,24],[20,23,20,24],[21,23,21,24],[22,19,22,20],[3,23,3,25],[22,23,22,24],[40,23,40,25],[41,23,41,25],[42,23,42,25]]}
[]
[]
[]
[null,"Reserve Costs Distributions",null,null,null,null,null,"Total Reserve Costs",null,null,null,"General Fund Costs Distributions",null,null,null,null,"Total Fund Costs",null,null,"Association Dues",null,null,null,"Income",null,null,null,null,null,null,null,null,null,null,null,null,null,"CHECK"]
[null,null,null,"Cost / Building","Cost per Unit","Cost per Unit/Year","Cost per Unit/Month","Total Cost per Year","Total Cost per Month",null,null,null,null,"Annual Cost","Cost per Unit/Year","Cost per Unit/Month","Total Cost per Year","Total Cost per Month",null,null,null,null,null,null,null,null,null,null,null,null,null,null,null,null,null,null,null,"RESERVE COSTS / Unit / Month",null,null,null,null,null,"GENERAL COSTS / Unit / Month",null,"TOTAL COSTS / Unit /Month"]
[null,{"$f":"IF('RESERVE Cost Estimates'!B7=\"\",\"\",'RESERVE Cost Estimates'!B7)","v":"Roofing Accrual"},null,null,null,null,null,null,null,null,null,"Category","Type",null,null,null,null,null,null,"Unit","Monthly Calculated Fee","Monthly Fee (Rounded Up)",null,"Unit","Unit Fee/Month","Unit Fee/Year",null,null,null,null,null,null,null,null,null,null,null,"Roofing","Road Repair","Painting & Power Wash","General Maintenance","Insurance","Legal-Prof. Fees"]
[null,{"$f":"IF('RESERVE Cost Estimates'!B8=\"\",\"\",'RESERVE Cost Estimates'!B8)","v":1270},null,{"$f":"IF('RESERVE Cost Estimates'!G8=\"\",\"\",'RESERVE Cost Estimates'!G8)","v":56801.992891000002},{"$f":"IF(D7=\"\",\"\",D7/'Tables & References'!C11)","v":7100.2491113750002},{"$f":"IF(E7=\"\",\"\",E7/roofing_recurrence_A)","v":355.01245556875},{"$f":"IF(F7=\"\",\"\",F7/12)","v":29.584371297395833},{"$f":"IF(F7=\"\",\"\",F7*'Tables & References'!C11)","v":2840.09964455},{"$f":"IF(H7=\"\",\"\",H7/12)","v":236.67497037916667},null,null,{"$f":"IF('GENERAL FUND Estimates'!B5=\"\",\"\",'GENERAL FUND Estimates'!B5)","v":"Administration Fee"},{"$f":"IF('GENERAL FUND Estimates'!C5=\"\",\"\",'GENERAL FUND Estimates'!C5)","v":"Business"},{"$f":"IF('GENERAL FUND Estimates'!F5=\"\",\"\",'GENERAL FUND Estimates'!F5)","v":10},{"$f":"IF(N7=\"\",\"\",N7/SUM('Tables & References'!$C$11:$C$16))","v":0.625},{"$f":"IF(O7=\"\",\"\",O7/12)","v":5.2083333333333336E-2},{"$f":"IF(O7=\"\",\"\",O7*SUM('Tables & References'!$C$11:$C$16))","v":10},{"$f":"IF(Q7=\"\",\"\",Q7/12)","v":0.83333333333333337},null,{"$f":"IF('Tables & References'!B11=\"\",\"\",'Tables & References'!B11)","v":1270},{"$f":"IF(T7=\"\",\"\",SUM(G7,G16,G19,G27,G35,G38,P28))","v":182.34826018628473},{"$f":"IF(U7=\"\",\"\",ROUNDUP(U7,0))","v":183},null,{"$f":"T7","v":1270},{"$f":"IF(X7=\"\",\"\",V7*'Tables & References'!C11)","v":1464},{"$f":"IF(X7=\"\",\"\",Y7*12)","v":17568},null,null,null,null,null,null,null,null,null,null,1270,{"$f":"G7","v":29.584371297395833},{"$f":"$G$16","v":11.135416666666666},{"$f":"G19","v":4.5399305555555554},{"$f":"G27","v":22.270833333333332},{"$f":"$G$35","v":30.208333333333332},{"$f":"$G$38","v":6.25},{"$f":"$P$28","v":78.359375},null,{"$f":"SUM(AL7:AR7)","v":182.34826018628473}]
[null,{"$f":"IF('RESERVE Cost Estimates'!B9=\"\",\"\",'RESERVE Cost Estimates'!B9)","v":1272},null,{"$f":"IF('RESERVE Cost Estimates'!G9=\"\",\"\",'RESERVE Cost Estimates'!G9)","v":28359.336095999999},{"$f":"IF(D8=\"\",\"\",D8/'Tables & References'!C12)","v":14179.668048},{"$f":"IF(E8=\"\",\"\",E8/roofing_recurrence_A)","v":708.98340239999993},{"$f":"IF(F8=\"\",\"\",F8/12)","v":59.081950199999994},{"$f":"IF(F8=\"\",\"\",F8*'Tables & References'!C12)","v":1417.9668047999999},{"$f":"IF(H8=\"\",\"\",H8/12)","v":118.16390039999999},null,null,{"$f":"IF('GENERAL FUND Estimates'!B6=\"\",\"\",'GENERAL FUND Estimates'!B6)","v":"Dues and Subscriptions"},{"$f":"IF('GENERAL FUND Estimates'!C6=\"\",\"\",'GENERAL FUND Estimates'!C6)","v":"Business"},{"$f":"IF('GENERAL FUND Estimates'!F6=\"\",\"\",'GENERAL FUND Estimates'!F6)","v":170},{"$f":"IF(N8=\"\",\"\",N8/SUM('Tables & References'!$C$11:$C$16))","v":10.625},{"$f":"IF(O8=\"\",\"\",O8/12)","v":0.88541666666666663},{"$f":"IF(O8=\"\",\"\",O8*SUM('Tables & References'!$C$11:$C$16))","v":170},{"$f":"IF(Q8=\"\",\"\",Q8/12)","v":14.166666666666666},null,{"$f":"IF('Tables & References'!B12=\"\",\"\",'Tables & References'!B12)","v":1272},{"$f":"IF(T8=\"\",\"\",SUM(G8,G16,G20,G28,G35,G38,P28))","v":231.0614640888889},{"$f":"IF(U8=\"\",\"\",ROUNDUP(U8,0))","v":232},null,{"$f":"T8","v":1272},{"$f":"IF(X8=\"\",\"\",V8*'Tables & References'!C12)","v":464},{"$f":"IF(X8=\"\",\"\",Y8*12)","v":5568},null,null,null,null,null,null,null,null,null,null,1272,{"$f":"G8","v":59.081950199999994},{"$f":"$G$16","v":11.135416666666666},{"$f":"G20","v":12.620138888888889},{"$f":"G28","v":33.40625},{"$f":"$G$35","v":30.208333333333332},{"$f":"$G$38","v":6.25},{"$f":"$P$28","v":78.359375},null,{"$f":"SUM(AL8:AR8)","v":231.0614640888889}]
{"$rows_left_out":37}
{"sheet":"Costs by Unit 1270","index":9,"n_rows":39,"n_cols":7,"rows_kept":39,"cut":false,"hidden":false,"merged":[[38,0,38,4]]}
["Hilary Heights Condominium Owners Association"]
["A Cost & Fee Analysis by Unit",null,null,"for the budget year of",{"$f":"current_budget_year","v":2019},"Unit",1270]
[null,null,null,"This Budget was approved by the Board of Directors on:",{"$f":"Approval_Date","v":"Sept 8th, 2018"}]
[]
["General Fund Expense (Shared by ALL Units)","Total Annual Budgeted Expense","Recurrence in Years","Cost per Year","Cost per Month","No. Units","Cost per Unit per month"]
[]
[{"$f":"'GENERAL FUND Estimates'!B5","v":"Administration Fee"},{"$f":"'GENERAL FUND Estimates'!F5","v":10},1,{"$f":"B7/C7","v":10},{"$f":"D7/12","v":0.83333333333333337},{"$f":"SUM('Tables & References'!$C$11:$C$16)","v":16},{"$f":"E7/F7","v":5.2083333333333336E-2}]
[{"$f":"'GENERAL FUND Estimates'!B6","v":"Dues and Subscriptions"},{"$f":"'GENERAL FUND Estimates'!F6","v":170},1,{"$f":"B8/C8","v":170},{"$f":"D8/12","v":14.166666666666666},{"$f":"SUM('Tables & References'!$C$11:$C$16)","v":16},{"$f":"E8/F8","v":0.88541666666666663}]
{"$rows_left_out":32}
{"sheet":"Costs by Unit 1272","index":10,"n_rows":39,"n_cols":7,"rows_kept":39,"cut":false,"hidden":false,"merged":[[38,0,38,4]]}
["Hilary Heights Condominium Owners Association"]
["A Cost & Fee Analysis by Unit",null,null,"for the budget year of",{"$f":"current_budget_year","v":2019},"Unit",1272]
[null,null,null,"This Budget was approved by the Board of Directors on:",{"$f":"Approval_Date","v":"Sept 8th, 2018"}]
[]
["General Fund Expense (Shared by ALL Units)","Total Annual Budgeted Expense","Recurrence in Years","Cost per Year","Cost per Month","No. Units","Cost per Unit per month"]
[]
[{"$f":"'GENERAL FUND Estimates'!B5","v":"Administration Fee"},{"$f":"'GENERAL FUND Estimates'!F5","v":10},1,{"$f":"B7/C7","v":10},{"$f":"D7/12","v":0.83333333333333337},{"$f":"SUM('Tables & References'!$C$11:$C$16)","v":16},{"$f":"E7/F7","v":5.2083333333333336E-2}]
[{"$f":"'GENERAL FUND Estimates'!B6","v":"Dues and Subscriptions"},{"$f":"'GENERAL FUND Estimates'!F6","v":170},1,{"$f":"B8/C8","v":170},{"$f":"D8/12","v":14.166666666666666},{"$f":"SUM('Tables & References'!$C$11:$C$16)","v":16},{"$f":"E8/F8","v":0.88541666666666663}]
{"$rows_left_out":32}
{"sheet":"Costs by Unit 1274","index":11,"n_rows":39,"n_cols":7,"rows_kept":39,"cut":false,"hidden":false,"merged":[[38,0,38,4]]}
["Hilary Heights Condominium Owners Association"]
["A Cost & Fee Analysis by Unit",null,null,"for the budget year of",{"$f":"current_budget_year","v":2019},"Unit",1274]
[null,null,null,"This Budget was approved by the Board of Directors on:",{"$f":"Approval_Date","v":"Sept 8th, 2018"}]
[]
["General Fund Expense (Shared by ALL Units)","Total Annual Budgeted Expense","Recurrence in Years","Cost per Year","Cost per Month","No. Units","Cost per Unit per month"]
[]
[{"$f":"'GENERAL FUND Estimates'!B5","v":"Administration Fee"},{"$f":"'GENERAL FUND Estimates'!F5","v":10},1,{"$f":"B7/C7","v":10},{"$f":"D7/12","v":0.83333333333333337},{"$f":"SUM('Tables & References'!$C$11:$C$16)","v":16},{"$f":"E7/F7","v":5.2083333333333336E-2}]
[{"$f":"'GENERAL FUND Estimates'!B6","v":"Dues and Subscriptions"},{"$f":"'GENERAL FUND Estimates'!F6","v":170},1,{"$f":"B8/C8","v":170},{"$f":"D8/12","v":14.166666666666666},{"$f":"SUM('Tables & References'!$C$11:$C$16)","v":16},{"$f":"E8/F8","v":0.88541666666666663}]
{"$rows_left_out":32}
{"sheet":"Costs by Unit 1276","index":12,"n_rows":39,"n_cols":7,"rows_kept":39,"cut":false,"hidden":false,"merged":[[38,0,38,4]]}
["Hilary Heights Condominium Owners Association"]
["A Cost & Fee Analysis by Unit",null,null,"for the budget year of",{"$f":"current_budget_year","v":2019},"Unit",1276]
[null,null,null,"This Budget was approved by the Board of Directors on:",{"$f":"Approval_Date","v":"Sept 8th, 2018"}]
[]
["General Fund Expense (Shared by ALL Units)","Total Annual Budgeted Expense","Recurrence in Years","Cost per Year","Cost per Month","No. Units","Cost per Unit per month"]
[]
[{"$f":"'GENERAL FUND Estimates'!B5","v":"Administration Fee"},{"$f":"'GENERAL FUND Estimates'!F5","v":10},1,{"$f":"B7/C7","v":10},{"$f":"D7/12","v":0.83333333333333337},{"$f":"SUM('Tables & References'!$C$11:$C$16)","v":16},{"$f":"E7/F7","v":5.2083333333333336E-2}]
[{"$f":"'GENERAL FUND Estimates'!B6","v":"Dues and Subscriptions"},{"$f":"'GENERAL FUND Estimates'!F6","v":170},1,{"$f":"B8/C8","v":170},{"$f":"D8/12","v":14.166666666666666},{"$f":"SUM('Tables & References'!$C$11:$C$16)","v":16},{"$f":"E8/F8","v":0.88541666666666663}]
{"$rows_left_out":32}
{"sheet":"Costs by Unit 1278","index":13,"n_rows":39,"n_cols":7,"rows_kept":39,"cut":false,"hidden":false,"merged":[[38,0,38,4]]}
["Hilary Heights Condominium Owners Association"]
["A Cost & Fee Analysis by Unit",null,null,"for the budget year of",{"$f":"current_budget_year","v":2019},"Unit",1278]
[null,null,null,"This Budget was approved by the Board of Directors on:",{"$f":"Approval_Date","v":"Sept 8th, 2018"}]
[]
["General Fund Expense (Shared by ALL Units)","Total Annual Budgeted Expense","Recurrence in Years","Cost per Year","Cost per Month","No. Units","Cost per Unit per month"]
[]
[{"$f":"'GENERAL FUND Estimates'!B5","v":"Administration Fee"},{"$f":"'GENERAL FUND Estimates'!F5","v":10},1,{"$f":"B7/C7","v":10},{"$f":"D7/12","v":0.83333333333333337},{"$f":"SUM('Tables & References'!$C$11:$C$16)","v":16},{"$f":"E7/F7","v":5.2083333333333336E-2}]
[{"$f":"'GENERAL FUND Estimates'!B6","v":"Dues and Subscriptions"},{"$f":"'GENERAL FUND Estimates'!F6","v":170},1,{"$f":"B8/C8","v":170},{"$f":"D8/12","v":14.166666666666666},{"$f":"SUM('Tables & References'!$C$11:$C$16)","v":16},{"$f":"E8/F8","v":0.88541666666666663}]
{"$rows_left_out":32}
{"sheet":"Calculated Budget Report","index":14,"n_rows":64,"n_cols":7,"rows_kept":64,"cut":false,"hidden":false,"merged":[[0,1,0,3],[2,1,2,3]]}
[null,"CONDOMINIUM OWNERS' ASSOCIATION"]
[]
[null,{"$f":"CONCATENATE(\"Annual Operating Budget for the Year of\",\" \",current_budget_year)","v":"Annual Operating Budget for the Year of 2019"}]
[null,"Category/Account","Month","Year"]
[]
[null,"GENERAL FUND (Checking - Cleveland State Bank)"]
[]
[null,"Income"]
{"$rows_left_out":57}
{"sheet":"Published Budget Report","index":15,"n_rows":64,"n_cols":11,"rows_kept":64,"cut":false,"hidden":false,"merged":[[0,1,0,3],[2,1,2,3]]}
[null,"CONDOMINIUM OWNERS' ASSOCIATION"]
[null,null,"Board Approval Date","Sept 8th, 2018"]
[null,{"$f":"CONCATENATE(\"Annual Operating Budget for the Year of\",\" \",current_budget_year)","v":"Annual Operating Budget for the Year of 2019"}]
[null,"Category/Account","Month","Year"]
[]
[null,"GENERAL FUND (Checking - Cleveland State Bank)"]
[]
[null,"Income"]
{"$rows_left_out":57}
{"sheet":"Sheet1","index":16,"n_rows":10,"n_cols":14,"rows_kept":10,"cut":false,"hidden":true,"merged":[]}
[]
[null,null,null,"Roofing Estimates"]
[null,null,null,"Kaltenbrun Quote","HHCOA Budget","Kaltenbrun Quote","Kaltenbrun Quote"]
[null,null,null,2008,2010,2012,2016,null,null,null,null,null,"2010 Budget"]
[null,null,null,"Timberline 40 year Shingles",null,"Timberline Lifetime Shingles","Timberline Lifetime Shingles",null,null,null,null,null,"Roofing"]
[null,null,1270,47000,47000,46650,48077,null,null,null,null,null,"8-Plex",47000]
[null,null,1272,23300,23000,23325,2400,null,null,null,null,null,1272,23000]
[null,null,1274,25675,25700,23325,2600,null,null,null,null,null,1274,25700]
{"$rows_left_out":2}